Reaction Details
TargetBDNF/NT-3 growth factors receptor
LigandBDBM164902
Substrate/Competitorn/a
Meas. Tech.TrkB Activity
IC50 0.200±n/a nM
Citation Kane, Jr., JLMatthews, GMetz, MKothe, MLiu, JScholte, A Tropomyosin-related kinase (TRK) inhibitors US Patent US9611265 Publication Date 4/4/2017
 
BDNF/NT-3 growth factors receptor
Name:BDNF/NT-3 growth factors receptor
Type:Enzyme
Mol. Mass.:91996.87
Organism:Homo sapiens (Human)
Description:Q16620
Residue:822
BDBM164902
NameBDBM164902
Synonyms:US10166239, Ex. 3-16 US9067914, Ex. 3-16
TypeSmall organic molecule
Emp. Form.C29H30N5O4P
Mol. Mass.543.5534
SMILESCOc1ccc(COc2ccc(Cn3c(N)nc4cc(cnc34)-c3ccc(nc3)P(C)(C)=O)cc2OC)cc1