Reaction Details
TargetBDNF/NT-3 growth factors receptor
LigandBDBM164929
Substrate/Competitorn/a
Meas. Tech.TrkB Activity
IC50 0.300±n/a nM
Citation Kane, Jr., JLMatthews, GMetz, MKothe, MLiu, JScholte, A Tropomyosin-related kinase (TRK) inhibitors US Patent US9611265 Publication Date 4/4/2017
 
BDNF/NT-3 growth factors receptor
Name:BDNF/NT-3 growth factors receptor
Type:Enzyme
Mol. Mass.:91996.87
Organism:Homo sapiens (Human)
Description:Q16620
Residue:822
BDBM164929
NameBDBM164929
Synonyms:US10166239, Ex. 3-35-3 US9067914, Ex. 3-35-3
TypeSmall organic molecule
Emp. Form.C26H23F3N6O2
Mol. Mass.508.495
SMILESCOc1cc(Cn2c(N)nc3cc(cnc23)-c2cnn(C)c2)ccc1OCc1ccc(cc1)C(F)(F)F