Reaction Details
TargetMacrophage colony-stimulating factor 1 receptor
LigandBDBM164931
Substrate/Competitorn/a
Meas. Tech.c-FMS Activity
IC50 5.00±n/a nM
Citation Kane, Jr., JLMatthews, GMetz, MKothe, MLiu, JScholte, A Tropomyosin-related kinase (TRK) inhibitors US Patent US9611265 Publication Date 4/4/2017
 
Macrophage colony-stimulating factor 1 receptor
Name:Macrophage colony-stimulating factor 1 receptor
Type:Protein
Mol. Mass.:107979.48
Organism:Homo sapiens (Human)
Description:P07333
Residue:972
BDBM164931
NameBDBM164931
Synonyms:US10166239, Ex. 3-35-5 US9067914, Ex. 3-35-5
TypeSmall organic molecule
Emp. Form.C23H23N7O2S
Mol. Mass.461.539
SMILESCOc1cc(Cn2c(N)nc3cc(cnc23)-c2cnn(C)c2)ccc1OCc1csc(C)n1