Reaction Details
TargetSteroid 21-hydroxylase
LigandBDBM50435990
Substrate/Competitorn/a
Meas. Tech.Enzyme Activity Assay
IC50 248±24 nM
Citation Aube, JScott, EEFehl, C Inhibitors of CYP17A1 US Patent US9611270 Publication Date 4/4/2017
 
Steroid 21-hydroxylase
Name:Steroid 21-hydroxylase
Type:PROTEIN
Mol. Mass.:55896.25
Organism:Homo sapiens (Human)
Description:ChEMBL_1498865
Residue:494
BDBM50435990
NameBDBM50435990
Synonyms:GALETERONE US9611270, galaterone VN/124-1
TypeSmall organic molecule
Emp. Form.C26H32N2O
Mol. Mass.388.5451
SMILESC[C@]12CC[C@H]3[C@@H](CC=C4C[C@@H](O)CC[C@]34C)[C@@H]1CC=C2n1cnc2ccccc12