Reaction Details
TargetProtein O-GlcNAcase
LigandBDBM314750
Substrate/Competitorn/a
Meas. Tech.Enzymatic Assay
Ki 0.820±n/a nM
Citation Selnick, HGLi, WHostetler, ELiu, KMcEachern, EJZhou, YWei, ZMu, CWang, YChang, J Permeable glycosidase inhibitors and uses thereof US Patent US9611275 Publication Date 4/4/2017
 
Protein O-GlcNAcase
Name:Protein O-GlcNAcase
Type:Enzyme
Mol. Mass.:102874.67
Organism:Homo sapiens (Human)
Description:O60502
Residue:916
BDBM314750
NameBDBM314750
Synonyms:(3aR,5S,6S,7R,7aR)-5-((R)-1-(4-(allyloxy)benzyloxy)-2,2,2-trifluoroethyl)-2-(dimethylamino)-5,6,7,7a-tetrahydro-3aH-pyrano[3,2-d]thiazole-6,7-diol | US9611275, Example 20
TypeSmall organic molecule
Emp. Form.C20H25F3N2O5S
Mol. Mass.462.483
SMILESCN(C)C1=N[C@H]2[C@H](O[C@H]([C@@H](OCc3ccc(OCC=C)cc3)C(F)(F)F)[C@@H](O)[C@@H]2O)S1