Reaction Details
TargetProtein O-GlcNAcase
LigandBDBM314809
Substrate/Competitorn/a
Meas. Tech.Enzymatic Assay
Ki 0.190±n/a nM
Citation Selnick, HGLi, WHostetler, ELiu, KMcEachern, EJZhou, YWei, ZMu, CWang, YChang, J Permeable glycosidase inhibitors and uses thereof US Patent US9611275 Publication Date 4/4/2017
 
Protein O-GlcNAcase
Name:Protein O-GlcNAcase
Type:Enzyme
Mol. Mass.:102874.67
Organism:Homo sapiens (Human)
Description:O60502
Residue:916
BDBM314809
NameBDBM314809
Synonyms:(3aR,5S,6S,7R,7aR)-2-(dimethylamino)-5-((R)-1-methoxyethyl)-5,6,7,7a-tetrahydro-3aH-pyrano[3,2-d]thiazole-6,7-diol & (3aR,5S,6S,7R,7aR)-2-(dimethylamino)-5-((S)-1-methoxyethyl)-5,6,7,7a-tetrahydro-3aH-pyrano[3,2-d]thiazole-6,7-diol | US9611275, Example 11
TypeSmall organic molecule
Emp. Form.C11H20N2O4S
Mol. Mass.276.352
SMILESCO[C@H](C)[C@H]1O[C@@H]2SC(=N[C@@H]2[C@@H](O)[C@@H]1O)N(C)C