Reaction Details
TargetAmine oxidase [flavin-containing] A
LigandBDBM10794
Substrate/CompetitorBDBM10755
Meas. Tech.Cholinesterase Inhibition Assay
IC50 27±n/a nM
Citation Sterling, JHerzig, YGoren, TFinkelstein, NLerner, DGoldenberg, WMiskolczi, IMolnar, SRantal, FTamas, TToth, GZagyva, AZekany, AFinberg, JLavian, GGross, AFriedman, RRazin, MHuang, WKrais, BChorev, MYoudim, MBWeinstock, M Novel dual inhibitors of AChE and MAO derived from hydroxy aminoindan and phenethylamine as potential treatment for Alzheimer's disease. J Med Chem45:5260-79 (2002) 
 
Amine oxidase [flavin-containing] A
Name:Amine oxidase [flavin-containing] A
Type:Enzyme
Mol. Mass.:59515.21
Organism:Rattus norvegicus (rat)
Description:n/a
Residue:526
BDBM10794
BDBM10755
NameBDBM10794
Synonyms:1-[methyl(prop-2-yn-1-yl)amino]-2,3-dihydro-1H-inden-4-yl N-ethyl-N-methylcarbamate | Aminoindan deriv. 29b
TypeSmall organic molecule
Emp. Form.C17H22N2O2
Mol. Mass.286.3688
SMILESCCN(C)C(=O)Oc1cccc2C(CCc12)N(C)CC#C