Reaction Details
TargetAcetylcholinesterase
LigandBDBM10826
Substrate/CompetitorBDBM10759
Meas. Tech.Cholinesterase Inhibition Assay
IC50 3060±n/a nM
Citation Sterling, JHerzig, YGoren, TFinkelstein, NLerner, DGoldenberg, WMiskolczi, IMolnar, SRantal, FTamas, TToth, GZagyva, AZekany, AFinberg, JLavian, GGross, AFriedman, RRazin, MHuang, WKrais, BChorev, MYoudim, MBWeinstock, M Novel dual inhibitors of AChE and MAO derived from hydroxy aminoindan and phenethylamine as potential treatment for Alzheimer's disease. J Med Chem45:5260-79 (2002) 
 
Acetylcholinesterase
Name:Acetylcholinesterase
Type:Enzyme
Mol. Mass.:67792.70
Organism:Homo sapiens (Human)
Description:P22303
Residue:614
BDBM10826
BDBM10759
NameBDBM10826
Synonyms:3-{2-[methyl(prop-2-yn-1-yl)amino]propyl}phenyl N-hexyl-N-methylcarbamate Phenethylamine deriv. 53d
TypeSmall organic molecule
Emp. Form.C21H32N2O2
Mol. Mass.344.491
SMILESCCCCCCN(C)C(=O)Oc1cccc(CC(C)N(C)CC#C)c1