Reaction Details
TargetAmine oxidase [flavin-containing] B
LigandBDBM10820
Substrate/CompetitorBDBM10758
Meas. Tech.Cholinesterase Inhibition Assay
IC50 170±n/a nM
Citation Sterling, JHerzig, YGoren, TFinkelstein, NLerner, DGoldenberg, WMiskolczi, IMolnar, SRantal, FTamas, TToth, GZagyva, AZekany, AFinberg, JLavian, GGross, AFriedman, RRazin, MHuang, WKrais, BChorev, MYoudim, MBWeinstock, M Novel dual inhibitors of AChE and MAO derived from hydroxy aminoindan and phenethylamine as potential treatment for Alzheimer's disease. J Med Chem45:5260-79 (2002) 
 
Amine oxidase [flavin-containing] B
Name:Amine oxidase [flavin-containing] B
Type:Enzyme
Mol. Mass.:58469.65
Organism:Rattus norvegicus (rat)
Description:P19643
Residue:520
BDBM10820
BDBM10758
NameBDBM10820
Synonyms:3-[2-(prop-2-yn-1-ylamino)propyl]phenyl N-methyl-N-propylcarbamate | Phenethylamine deriv. 52c
TypeSmall organic molecule
Emp. Form.C17H24N2O2
Mol. Mass.288.3847
SMILESCCCN(C)C(=O)Oc1cccc(CC(C)NCC#C)c1