Reaction Details
TargetCarbonic anhydrase 1
LigandBDBM10855
Substrate/Competitorn/a
Meas. Tech.Known Inhibitors of Carbonic Anhydrase
IC50 295±n/a nM
Citation Collier, GRWalder, KRCampbell, JAMolero-Navajas, JKonstantopoulos, NKrippner, GY Insulin sensitisers and methods of treatment US Patent US10172837 Publication Date 1/8/2019
 
Carbonic anhydrase 1
Name:Carbonic anhydrase 1
Type:Enzyme
Mol. Mass.:28873.37
Organism:Homo sapiens (Human)
Description:P00915
Residue:261
BDBM10855
NameBDBM10855
Synonyms:2-aminobenzene-1-sulfonamide US10172837, 2-aminobenzenesulfonamide orthanilamide 17
TypeSmall organic molecule
Emp. Form.C6H8N2O2S
Mol. Mass.172.205
SMILESNc1ccccc1S(N)(=O)=O