Reaction Details
TargetSerine/threonine-protein kinase mTOR
LigandBDBM315519
Substrate/Competitorn/a
Meas. Tech.In vitro kinase assay
IC50<5±n/a nM
Citation Liu, YRen, PJessen, KGuo, XRommel, C Combination pharmaceutical compositions and uses thereof US Patent US10172858 Publication Date 1/8/2019
 
Serine/threonine-protein kinase mTOR
Name:Serine/threonine-protein kinase mTOR
Type:Rapamycin target protein
Mol. Mass.:288917.12
Organism:Homo sapiens (Human)
Description:P42345
Residue:2549
BDBM315519
NameBDBM315519
Synonyms:US10172858, Table 2.15 | US9828378, # 15
TypeSmall organic molecule
Emp. Form.C16H15ClN6O
Mol. Mass.342.783
SMILESCC(C)n1nc(-c2cc3cc(O)cc(Cl)c3[nH]2)c2c(N)ncnc12