Reaction Details
TargetSerine/threonine-protein kinase mTOR
LigandBDBM315520
Substrate/Competitorn/a
Meas. Tech.In vitro kinase assay
IC50<5±n/a nM
Citation Liu, YRen, PJessen, KGuo, XRommel, C Combination pharmaceutical compositions and uses thereof US Patent US10172858 Publication Date 1/8/2019
 
Serine/threonine-protein kinase mTOR
Name:Serine/threonine-protein kinase mTOR
Type:Rapamycin target protein
Mol. Mass.:288917.12
Organism:Homo sapiens (Human)
Description:P42345
Residue:2549
BDBM315520
NameBDBM315520
Synonyms:US10172858, Table 2.16 | US9828378, # 16
TypeSmall organic molecule
Emp. Form.C16H15FN6O
Mol. Mass.326.3283
SMILESCC(C)n1nc(-c2cc3cc(O)cc(F)c3[nH]2)c2c(N)ncnc12