Reaction Details
TargetSerine/threonine-protein kinase mTOR
LigandBDBM315568
Substrate/Competitorn/a
Meas. Tech.In vitro kinase assay
IC50<10±n/a nM
Citation Liu, YRen, PJessen, KGuo, XRommel, C Combination pharmaceutical compositions and uses thereof US Patent US10172858 Publication Date 1/8/2019
 
Serine/threonine-protein kinase mTOR
Name:Serine/threonine-protein kinase mTOR
Type:Rapamycin target protein
Mol. Mass.:288917.12
Organism:Homo sapiens (Human)
Description:P42345
Residue:2549
BDBM315568
NameBDBM315568
Synonyms:US10172858, Table 2.65 | US9828378, # 65
TypeSmall organic molecule
Emp. Form.C20H21N7O2
Mol. Mass.391.4264
SMILESCC(=O)N1CCC(CC1)n1nc(-c2cc3ccc(O)cc3[nH]2)c2c(N)ncnc12