Reaction Details
TargetIsocitrate dehydrogenase [NADP] cytoplasmic [R132C]
LigandBDBM279855
Substrate/Competitorn/a
Meas. Tech.In Vitro Assays for IDH1m (R132H or R132C) Inhibitors
IC50<50±n/a nM
Citation Konteatis, ZDPopovici-Muller, JTravins, JMZahler, RCai, ZZhou, D Therapeutically active compounds and their methods of use US Patent US10172864 Publication Date 1/8/2019
 
Isocitrate dehydrogenase [NADP] cytoplasmic [R132C]
Name:Isocitrate dehydrogenase [NADP] cytoplasmic [R132C]
Type:Enzyme Catalytic Domain
Mol. Mass.:46607.23
Organism:Homo sapiens (Human)
Description:O75874[R132C]
Residue:414
BDBM279855
NameBDBM279855
Synonyms:US10028961, Compound 2 US10946023, Compound 2
TypeSmall organic molecule
Emp. Form.C19H23F3N6
Mol. Mass.392.4213
SMILESC[C@@H](Nc1nc(N[C@H](C)C2CC2)nc(n1)-c1cccc(n1)C(F)(F)F)C1CC1