Reaction Details
TargetMyeloperoxidase
LigandBDBM312265
Substrate/Competitorn/a
Meas. Tech.Inhibitory Activity
IC50 49.0±n/a nM
Citation Inghardt, TBJohannesson, PJurva, ULindstedt-Alstermark, ETomkinson, NStonehouse, JP 1-[2-(aminomethyl)benzyl]-2-thioxo-1,2,3,5-tetrahydro-4H-pyrrolo[3,2-d]pyrimidin-4-ones as inhibitors of myeloperoxidase US Patent US9616063 Publication Date 4/11/2017
 
Myeloperoxidase
Name:Myeloperoxidase
Type:Enzyme
Mol. Mass.:83888.32
Organism:Homo sapiens (Human)
Description:P05164
Residue:745
BDBM312265
NameBDBM312265
Synonyms:1-{2-[(Methylamino)methyl]-4-(trifluoromethyl)benzyl}-2-thioxo-1,2,3,5-tetrahydro-4H-pyrrolo[3,2-d]pyrimidin-4-one US11000525, Example 15 | US9616063, 15
TypeSmall organic molecule
Emp. Form.C16H15F3N4OS
Mol. Mass.368.377
SMILESCNCc1cc(ccc1Cn1c2cc[nH]c2c(=O)[nH]c1=S)C(F)(F)F