Reaction Details
TargetLysine-specific histone demethylase 1A
LigandBDBM254603
Substrate/Competitorn/a
Meas. Tech.LSD1 Assays
pH7.4±n/a
Temperature298.15±n/a K
Ki 550±n/a nM
Commentsextracted
Citation Ortega Muñoz, AFyfe, MCMartinell Pedemonte, MEstiarte Martinez, MValls Vidal, NKurz, GCastro Palomino Laria, JC (Hetero)aryl cyclopropylamine compounds as LSD1 inhibitors US Patent US9670136 Publication Date 6/6/2017
 
Lysine-specific histone demethylase 1A
Name:Lysine-specific histone demethylase 1A
Type:Enzyme
Mol. Mass.:92901.01
Organism:Homo sapiens (Human)
Description:O60341
Residue:852
BDBM254603
NameBDBM254603
Synonyms:US10214477, Example 5 US9670136, 3 (trans)-N1-((1S,2R)-2-phenylcyclopropyl)cyclohexane-1,4-diamine
TypeSmall organic molecule
Emp. Form.C15H22N2
Mol. Mass.230.3486
SMILESNC1CCC(CC1)N[C@@H]1C[C@H]1c1ccccc1