Reaction Details
TargetAmine oxidase [flavin-containing] B
LigandBDBM254555
Substrate/Competitorn/a
Meas. Tech.Monoamine Oxidase Assays
Ki 20500±n/a nM
Citation Ortega Muñoz, AFyfe, MCMartinell Pedemonte, MEstiarte Martinez, MValls Vidal, NKurz, GCastro Palomino Laria, JC (Hetero)aryl cyclopropylamine compounds as LSD1 inhibitors US Patent US9670136 Publication Date 6/6/2017
 
Amine oxidase [flavin-containing] B
Name:Amine oxidase [flavin-containing] B
Type:Protein
Mol. Mass.:58768.76
Organism:Homo sapiens (Human)
Description:P27338
Residue:520
BDBM254555
NameBDBM254555
Synonyms:US10214477, Example 14 US9670136, 14 N-(4-(((trans)-2-(6-(3-(trifluoromethyl)phenyl)pyridin-3-yl)cyclopropyl)amino)cyclohexyl)methanesulfonamide
TypeSmall organic molecule
Emp. Form.C22H26F3N3O2S
Mol. Mass.453.521
SMILESCS(=O)(=O)NC1CCC(CC1)N[C@H]1C[C@@H]1c1ccc(nc1)-c1cccc(c1)C(F)(F)F