Reaction Details
TargetCyclin-dependent kinase 9
LigandBDBM316174
Substrate/Competitorn/a
Meas. Tech.Fluorescent Polarization Assay
IC50<100±n/a nM
Citation Lori, FChafouleas, JDe Forni, DSolinas, AVarga, ZGreff, ZÖrfi, LKéri, G 4,6-disubstituted aminopyrimidine derivatives have anti-HIV activity US Patent US9617225 Publication Date 4/11/2017
 
Cyclin-dependent kinase 9
Name:Cyclin-dependent kinase 9
Type:Enzyme Subunit
Mol. Mass.:42789.13
Organism:Homo sapiens (Human)
Description:n/a
Residue:372
BDBM316174
NameBDBM316174
Synonyms:N-(3-((1H-benzo[d]imidazol-1-yl)methyl)-4-(4-methylpiperazin-1-yl)phenyl)-6-(2-methoxyphenyl)pyrimidin-4-amine US9617225, Example 2
TypeSmall organic molecule
Emp. Form.C30H31N7O
Mol. Mass.505.6134
SMILESCOc1ccccc1-c1cc(Nc2ccc(N3CCN(C)CC3)c(Cn3cnc4ccccc34)c2)ncn1