Reaction Details
TargetCyclin-dependent kinase 9
LigandBDBM316189
Substrate/Competitorn/a
Meas. Tech.Fluorescent Polarization Assay
IC50<100±n/a nM
Citation Lori, FChafouleas, JDe Forni, DSolinas, AVarga, ZGreff, ZÖrfi, LKéri, G 4,6-disubstituted aminopyrimidine derivatives have anti-HIV activity US Patent US9617225 Publication Date 4/11/2017
 
Cyclin-dependent kinase 9
Name:Cyclin-dependent kinase 9
Type:Enzyme Subunit
Mol. Mass.:42789.13
Organism:Homo sapiens (Human)
Description:n/a
Residue:372
BDBM316189
NameBDBM316189
Synonyms:(5-(6-(2-methoxyphenyl)pyrimidin-4-ylamino)-2-(4-methylpiperazin-1-yl)phenyl)methanol US9617225, Example 17
TypeSmall organic molecule
Emp. Form.C23H27N5O2
Mol. Mass.405.4928
SMILESCOc1ccccc1-c1cc(Nc2ccc(N3CCN(C)CC3)c(CO)c2)ncn1