Reaction Details
TargetCyclin-dependent kinase 9
LigandBDBM316207
Substrate/Competitorn/a
Meas. Tech.Fluorescent Polarization Assay
IC50<100±n/a nM
Citation Lori, FChafouleas, JDe Forni, DSolinas, AVarga, ZGreff, ZÖrfi, LKéri, G 4,6-disubstituted aminopyrimidine derivatives have anti-HIV activity US Patent US9617225 Publication Date 4/11/2017
 
Cyclin-dependent kinase 9
Name:Cyclin-dependent kinase 9
Type:Enzyme Subunit
Mol. Mass.:42789.13
Organism:Homo sapiens (Human)
Description:n/a
Residue:372
BDBM316207
NameBDBM316207
Synonyms:N-(3-((dimethylamino)methyl)-4-methoxyphenyl)-6-(2-methoxyphenyl)pyrimidin-4-amine US9617225, Example 35
TypeSmall organic molecule
Emp. Form.C21H24N4O2
Mol. Mass.364.4409
SMILESCOc1ccc(Nc2cc(ncn2)-c2ccccc2OC)cc1CN(C)C