Reaction Details
TargetCyclin-dependent kinase 9
LigandBDBM316227
Substrate/Competitorn/a
Meas. Tech.Fluorescent Polarization Assay
IC50<100±n/a nM
Citation Lori, FChafouleas, JDe Forni, DSolinas, AVarga, ZGreff, ZÖrfi, LKéri, G 4,6-disubstituted aminopyrimidine derivatives have anti-HIV activity US Patent US9617225 Publication Date 4/11/2017
 
Cyclin-dependent kinase 9
Name:Cyclin-dependent kinase 9
Type:Enzyme Subunit
Mol. Mass.:42789.13
Organism:Homo sapiens (Human)
Description:n/a
Residue:372
BDBM316227
NameBDBM316227
Synonyms:N-{2-Methoxy-5-[6-(2-methoxy-phenyl)-pyrimidin-4-ylamino]-phenyl}-formamide US9617225, Example 55
TypeSmall organic molecule
Emp. Form.C19H18N4O3
Mol. Mass.350.3712
SMILESCOc1ccc(Nc2cc(ncn2)-c2ccccc2OC)cc1NC=O