Reaction Details
TargetCyclin-dependent kinase 9
LigandBDBM316288
Substrate/Competitorn/a
Meas. Tech.Fluorescent Polarization Assay
IC50<100±n/a nM
Citation Lori, FChafouleas, JDe Forni, DSolinas, AVarga, ZGreff, ZÖrfi, LKéri, G 4,6-disubstituted aminopyrimidine derivatives have anti-HIV activity US Patent US9617225 Publication Date 4/11/2017
 
Cyclin-dependent kinase 9
Name:Cyclin-dependent kinase 9
Type:Enzyme Subunit
Mol. Mass.:42789.13
Organism:Homo sapiens (Human)
Description:n/a
Residue:372
BDBM316288
NameBDBM316288
Synonyms:US10294218, Example 116 [6-(2-Methoxy-phenyl)-pyrimidin-4-yl]-[4-methoxy-3-(1,2,3,6-tetrahydro-pyridin-4-yl)-phenyl]-amine
TypeSmall organic molecule
Emp. Form.C23H24N4O2
Mol. Mass.388.4623
SMILESCOc1ccccc1-c1cc(Nc2ccc(OC)c(c2)C2=CCNCC2)ncn1