Reaction Details
TargetBeta-glucuronidase
LigandBDBM316380
Substrate/Competitorn/a
Meas. Tech. β-Glucuronidase Activity Assay
IC50 270±n/a nM
Citation Williams, ALScott, JYeh, LRedinbo, MR Phenoxy thiophene sulfonamides and their use as inhibitors of glucuronidase US Patent US9617239 Publication Date 4/11/2017
 
Beta-glucuronidase
Name:Beta-glucuronidase
Type:Protein
Mol. Mass.:74736.05
Organism:Homo sapiens (Human)
Description:n/a
Residue:651
BDBM316380
NameBDBM316380
Synonyms:US9617239, BRITE-354966
TypeSmall organic molecule
Emp. Form.C21H29N3O3S2
Mol. Mass.435.603
SMILESO=S(=O)(NCC1CCCCC1)c1ccc(Oc2cccc(c2)N2CCNCC2)s1