Reaction Details
TargetBeta-glucuronidase
LigandBDBM316382
Substrate/Competitorn/a
Meas. Tech. β-Glucuronidase Activity Assay
IC50 290±n/a nM
Citation Williams, ALScott, JYeh, LRedinbo, MR Phenoxy thiophene sulfonamides and their use as inhibitors of glucuronidase US Patent US9617239 Publication Date 4/11/2017
 
Beta-glucuronidase
Name:Beta-glucuronidase
Type:Protein
Mol. Mass.:74736.05
Organism:Homo sapiens (Human)
Description:n/a
Residue:651
BDBM316382
NameBDBM316382
Synonyms:US9617239, BRITE-354965
TypeSmall organic molecule
Emp. Form.C23H27N3O5S2
Mol. Mass.489.608
SMILESCOc1ccc(CNS(=O)(=O)c2ccc(Oc3cccc(c3)N3CCNCC3)s2)cc1OC