Reaction Details
TargetBeta-glucuronidase
LigandBDBM316462
Substrate/Competitorn/a
Meas. Tech. β-Glucuronidase Activity Assay
IC50 300±n/a nM
Citation Williams, ALScott, JYeh, LRedinbo, MR Phenoxy thiophene sulfonamides and their use as inhibitors of glucuronidase US Patent US9617239 Publication Date 4/11/2017
 
Beta-glucuronidase
Name:Beta-glucuronidase
Type:Protein
Mol. Mass.:74736.05
Organism:Homo sapiens (Human)
Description:n/a
Residue:651
BDBM316462
NameBDBM316462
Synonyms:US9617239, BRITE-492806
TypeSmall organic molecule
Emp. Form.C25H24ClN3O3S2
Mol. Mass.514.059
SMILESClc1cc(sc1Oc1ccc(cc1)N1CCNCC1)S(=O)(=O)NCc1cccc2ccccc12