Reaction Details
TargetBeta-glucuronidase
LigandBDBM316467
Substrate/Competitorn/a
Meas. Tech. β-Glucuronidase Activity Assay
IC50 30.0±n/a nM
Citation Williams, ALScott, JYeh, LRedinbo, MR Phenoxy thiophene sulfonamides and their use as inhibitors of glucuronidase US Patent US9617239 Publication Date 4/11/2017
 
Beta-glucuronidase
Name:Beta-glucuronidase
Type:Protein
Mol. Mass.:74736.05
Organism:Homo sapiens (Human)
Description:n/a
Residue:651
BDBM316467
NameBDBM316467
Synonyms:US9617239, BRITE-492808
TypeSmall organic molecule
Emp. Form.C22H24ClN3O3S2
Mol. Mass.478.027
SMILESCc1cccc(CNS(=O)(=O)c2cc(Cl)c(Oc3cccc(c3)N3CCNCC3)s2)c1