Reaction Details
TargetTyrosine-protein kinase JAK3
LigandBDBM316530
Substrate/Competitorn/a
Meas. Tech.JAK Caliper Enzyme Assay
IC50 0.200±n/a nM
Citation Thorarensen, ABrown, MFCasimiro-Garcia, AChe, YCoe, JWFlanagan, MEGilbert, AMHayward, MMLangille, JDMontgomery, JITelliez, JUnwalla, RJTrujillo, JI Pyrrolo[2,3-d]pyrimidinyl, pyrrolo[2,3-b]pyrazinyl and pyrrolo[2,3-d]pyridinyl acrylamides US Patent US9617258 Publication Date 4/11/2017
 
Tyrosine-protein kinase JAK3
Name:Tyrosine-protein kinase JAK3
Type:Protein
Mol. Mass.:125111.08
Organism:Homo sapiens (Human)
Description:P52333
Residue:1124
BDBM316530
NameBDBM316530
Synonyms:US9617258, Example 18
TypeSmall organic molecule
Emp. Form.C15H18ClN5O
Mol. Mass.319.789
SMILESC[C@H]1CC[C@H](CN1C(=O)C=C)Nc1ncnc2[nH]cc(Cl)c12