Reaction Details
TargetTyrosine-protein kinase JAK3
LigandBDBM316714
Substrate/Competitorn/a
Meas. Tech.JAK Caliper Enzyme Assay
IC50 0.200±n/a nM
Citation Thorarensen, ABrown, MFCasimiro-Garcia, AChe, YCoe, JWFlanagan, MEGilbert, AMHayward, MMLangille, JDMontgomery, JITelliez, JUnwalla, RJTrujillo, JI Pyrrolo[2,3-d]pyrimidinyl, pyrrolo[2,3-b]pyrazinyl and pyrrolo[2,3-d]pyridinyl acrylamides US Patent US9617258 Publication Date 4/11/2017
 
Tyrosine-protein kinase JAK3
Name:Tyrosine-protein kinase JAK3
Type:Protein
Mol. Mass.:125111.08
Organism:Homo sapiens (Human)
Description:P52333
Residue:1124
BDBM316714
NameBDBM316714
Synonyms:1-{4-[(7-phenyl-5H-pyrrolo[2,3-b]pyrazin-2-yl)amino]piperidin-1-yl}prop-2-en-1-one US9617258, Example 209
TypeSmall organic molecule
Emp. Form.C20H21N5O
Mol. Mass.347.4136
SMILESC=CC(=O)N1CCC(CC1)Nc1cnc2[nH]cc(-c3ccccc3)c2n1