Reaction Details
TargetTyrosine-protein kinase JAK3
LigandBDBM316716
Substrate/Competitorn/a
Meas. Tech.JAK Caliper Enzyme Assay
IC50 0.200±n/a nM
Citation Thorarensen, ABrown, MFCasimiro-Garcia, AChe, YCoe, JWFlanagan, MEGilbert, AMHayward, MMLangille, JDMontgomery, JITelliez, JUnwalla, RJTrujillo, JI Pyrrolo[2,3-d]pyrimidinyl, pyrrolo[2,3-b]pyrazinyl and pyrrolo[2,3-d]pyridinyl acrylamides US Patent US9617258 Publication Date 4/11/2017
 
Tyrosine-protein kinase JAK3
Name:Tyrosine-protein kinase JAK3
Type:Protein
Mol. Mass.:125111.08
Organism:Homo sapiens (Human)
Description:P52333
Residue:1124
BDBM316716
NameBDBM316716
Synonyms:1-(4-{[7-(2-fluoropyridin-4-yl)-5H-pyrrolo[2,3-b]pyrazin-2-yl]amino}piperidin-1-yl)prop-2-en-1-one US9617258, Example 211
TypeSmall organic molecule
Emp. Form.C19H19FN6O
Mol. Mass.366.3922
SMILESFc1cc(ccn1)-c1c[nH]c2ncc(NC3CCN(CC3)C(=O)C=C)nc12