Reaction Details
TargetTyrosine-protein kinase JAK3
LigandBDBM316745
Substrate/Competitorn/a
Meas. Tech.JAK Caliper Enzyme Assay
IC50 0.100±n/a nM
Citation Thorarensen, ABrown, MFCasimiro-Garcia, AChe, YCoe, JWFlanagan, MEGilbert, AMHayward, MMLangille, JDMontgomery, JITelliez, JUnwalla, RJTrujillo, JI Pyrrolo[2,3-d]pyrimidinyl, pyrrolo[2,3-b]pyrazinyl and pyrrolo[2,3-d]pyridinyl acrylamides US Patent US9617258 Publication Date 4/11/2017
 
Tyrosine-protein kinase JAK3
Name:Tyrosine-protein kinase JAK3
Type:Protein
Mol. Mass.:125111.08
Organism:Homo sapiens (Human)
Description:P52333
Residue:1124
BDBM316745
NameBDBM316745
Synonyms:2-[(1-acryloylpiperidin-4-yl)amino]-N-(3-cyanopropyl)-5H-pyrrolo[2,3-b]pyrazine-7-carboxamide US9617258, Example 242
TypeSmall organic molecule
Emp. Form.C19H23N7O2
Mol. Mass.381.4316
SMILESC=CC(=O)N1CCC(CC1)Nc1cnc2[nH]cc(C(=O)NCCCC#N)c2n1