Reaction Details
TargetTyrosine-protein kinase JAK3
LigandBDBM316765
Substrate/Competitorn/a
Meas. Tech.JAK Caliper Enzyme Assay
IC50 0.200±n/a nM
Citation Thorarensen, ABrown, MFCasimiro-Garcia, AChe, YCoe, JWFlanagan, MEGilbert, AMHayward, MMLangille, JDMontgomery, JITelliez, JUnwalla, RJTrujillo, JI Pyrrolo[2,3-d]pyrimidinyl, pyrrolo[2,3-b]pyrazinyl and pyrrolo[2,3-d]pyridinyl acrylamides US Patent US9617258 Publication Date 4/11/2017
 
Tyrosine-protein kinase JAK3
Name:Tyrosine-protein kinase JAK3
Type:Protein
Mol. Mass.:125111.08
Organism:Homo sapiens (Human)
Description:P52333
Residue:1124
BDBM316765
NameBDBM316765
Synonyms:2-[(1-acryloylpiperidin-4-yl)amino]-N-(8-cyanooctyl)-5H-pyrrolo[2,3-b]pyrazine-7-carboxamide US9617258, Example 260
TypeSmall organic molecule
Emp. Form.C24H33N7O2
Mol. Mass.451.5645
SMILESC=CC(=O)N1CCC(CC1)Nc1cnc2[nH]cc(C(=O)NCCCCCCCCC#N)c2n1