Reaction Details
TargetTyrosine-protein kinase JAK3
LigandBDBM316793
Substrate/Competitorn/a
Meas. Tech.JAK Caliper Enzyme Assay
IC50 0.300±n/a nM
Citation Thorarensen, ABrown, MFCasimiro-Garcia, AChe, YCoe, JWFlanagan, MEGilbert, AMHayward, MMLangille, JDMontgomery, JITelliez, JUnwalla, RJTrujillo, JI Pyrrolo[2,3-d]pyrimidinyl, pyrrolo[2,3-b]pyrazinyl and pyrrolo[2,3-d]pyridinyl acrylamides US Patent US9617258 Publication Date 4/11/2017
 
Tyrosine-protein kinase JAK3
Name:Tyrosine-protein kinase JAK3
Type:Protein
Mol. Mass.:125111.08
Organism:Homo sapiens (Human)
Description:P52333
Residue:1124
BDBM316793
NameBDBM316793
Synonyms:2-[(1-acryloylpiperidin-4-yl)amino]-N-[(2R)-butan-2-yl]-5H-pyrrolo[2,3-b]pyrazine-7- US9617258, Example 289
TypeSmall organic molecule
Emp. Form.C19H26N6O2
Mol. Mass.370.4487
SMILESCC[C@@H](C)NC(=O)c1c[nH]c2ncc(NC3CCN(CC3)C(=O)C=C)nc12