Reaction Details
TargetTyrosine-protein kinase JAK3
LigandBDBM316840
Substrate/Competitorn/a
Meas. Tech.JAK Caliper Enzyme Assay
IC50 0.100±n/a nM
Citation Thorarensen, ABrown, MFCasimiro-Garcia, AChe, YCoe, JWFlanagan, MEGilbert, AMHayward, MMLangille, JDMontgomery, JITelliez, JUnwalla, RJTrujillo, JI Pyrrolo[2,3-d]pyrimidinyl, pyrrolo[2,3-b]pyrazinyl and pyrrolo[2,3-d]pyridinyl acrylamides US Patent US9617258 Publication Date 4/11/2017
 
Tyrosine-protein kinase JAK3
Name:Tyrosine-protein kinase JAK3
Type:Protein
Mol. Mass.:125111.08
Organism:Homo sapiens (Human)
Description:P52333
Residue:1124
BDBM316840
NameBDBM316840
Synonyms:US11111242, Example 343 | US9617258, Example 343
TypeSmall organic molecule
Emp. Form.C18H20N6O2
Mol. Mass.352.3904
SMILESC=CC(=O)N1CCC(CC1)Nc1cnc2[nH]cc(C(=O)NCC#C)c2n1