Reaction Details
TargetHistone deacetylase 4
LigandBDBM293890
Substrate/Competitorn/a
Meas. Tech.Inhibition Assay
IC50 20.0±n/a nM
Citation Dominguez, CMuñoz-Sanjuán, IMaillard, MLuckhurst, CAJarvis, REBürli, RWAllen, DRHaughan, AFBreccia, PVater, HDStott, AJPenrose, SDWall, MSaville-Stones, EAWishart, GHughes, SJ Histone deacetylase inhibitors and compositions and methods of use thereof US Patent US9617259 Publication Date 4/11/2017
 
Histone deacetylase 4
Name:Histone deacetylase 4
Type:Enzyme
Mol. Mass.:119049.39
Organism:Homo sapiens (Human)
Description:P56524
Residue:1084
BDBM293890
NameBDBM293890
Synonyms:(S)-1-(3-Fluoro-2- methylphenyl)-N- hydroxy-3-(6- (trifluoromethyl)pyridin- 3-yl)cyclopent-2- enecarboxamide US9617259, 16
TypeSmall organic molecule
Emp. Form.C19H16F4N2O2
Mol. Mass.380.3362
SMILESCc1c(F)cccc1[C@@]1(CCC(=C1)c1ccc(nc1)C(F)(F)F)C(=O)NO