Reaction Details
TargetDual specificity mitogen-activated protein kinase kinase 1
LigandBDBM316886
Substrate/Competitorn/a
Meas. Tech.LANCE Ultra Assay
IC50<500±n/a nM
Citation Lee, GJeon, HSJeon, KJRhim, CYKim, JSSeo, JCho, SYKim, CSLee, JSChoi, EKHwang, JJKim, B Substituted pyridinone compounds as MEK inhibitors US Patent US9617261 Publication Date 4/11/2017
 
Dual specificity mitogen-activated protein kinase kinase 1
Name:Dual specificity mitogen-activated protein kinase kinase 1
Type:Other Protein Type
Mol. Mass.:43439.03
Organism:Homo sapiens (Human)
Description:Full-length human MEK-1 was generated by PCR and purified as a fusion protein from Escherichia coli lysates.
Residue:393
BDBM316886
NameBDBM316886
Synonyms:US9617261, Example 00087
TypeSmall organic molecule
Emp. Form.C20H23FIN3O4
Mol. Mass.515.3172
SMILESCn1c(Nc2ccc(I)cc2F)c(C(=O)NOCCO)c2CC(C)(C)Cc2c1=O