Reaction Details
TargetEndochitinase B1
LigandBDBM10850
Substrate/CompetitorBDBM10848
Meas. Tech.Enzyme Inhibition Assay
pH5.5±n/a
Temperature310.15±n/a K
Ki 37000±2000 nM
IC50 126000±7000 nM
Citation Rao, FVAndersen, OAVora, KADemartino, JAvan Aalten, DM Methylxanthine drugs are chitinase inhibitors: investigation of inhibition and binding modes. Chem Biol12:973-80 (2005) 
 
Endochitinase B1
Name:Endochitinase B1
Type:Enzyme
Mol. Mass.:47612.97
Organism:Aspergillus fumigatus
Description:Q873X9
Residue:433
BDBM10850
BDBM10848
NameBDBM10850
Synonyms:1-(5-Oxohexyl)theobromine (pentoxifylline) 3,7-dimethyl-1-(5-oxohexyl)-3,7-dihydropurine-2,6-dione Pentoxifylline Pentoxyphylline
TypeSmall organic molecule
Emp. Form.C13H18N4O3
Mol. Mass.278.307
SMILESCC(=O)CCCCn1c(=O)n(C)c2ncn(C)c2c1=O