Reaction Details
TargetcAMP-specific 3',5'-cyclic phosphodiesterase 4A
LigandBDBM10849
Substrate/CompetitorBDBM10851
Meas. Tech.PDE 4A Assay
pH7.5±n/a
Temperature303.15±n/a K
IC50 747000±212000 nM
Citation Rao, FVAndersen, OAVora, KADemartino, JAvan Aalten, DM Methylxanthine drugs are chitinase inhibitors: investigation of inhibition and binding modes. Chem Biol12:973-80 (2005) 
 
cAMP-specific 3',5'-cyclic phosphodiesterase 4A
Name:cAMP-specific 3',5'-cyclic phosphodiesterase 4A
Type:Enzyme
Mol. Mass.:98113.27
Organism:Homo sapiens (Human)
Description:P27815
Residue:886
BDBM10849
BDBM10851
NameBDBM10849
Synonyms:1,3,7-trimethyl-2,3,6,7-tetrahydro-1H-purine-2,6-dione CHEMBL113 caffeine
TypeSmall organic molecule
Emp. Form.C8H10N4O2
Mol. Mass.194.1906
SMILESCn1cnc2n(C)c(=O)n(C)c(=O)c12