Reaction Details
TargetEndochitinase B1 [D175A]
LigandBDBM10850
Substrate/CompetitorBDBM10852
Meas. Tech.Enzyme Inhibition Assay
Kd 100000±n/a nM
Citation Rao, FVAndersen, OAVora, KADemartino, JAvan Aalten, DM Methylxanthine drugs are chitinase inhibitors: investigation of inhibition and binding modes. Chem Biol12:973-80 (2005) 
 
Endochitinase B1 [D175A]
Name:Endochitinase B1 [D175A]
Type:Enzyme
Mol. Mass.:47569.97
Organism:Aspergillus fumigatus
Description:Q873X9[D175A]
Residue:433
BDBM10850
BDBM10852
NameBDBM10850
Synonyms:1-(5-Oxohexyl)theobromine (pentoxifylline) 3,7-dimethyl-1-(5-oxohexyl)-3,7-dihydropurine-2,6-dione Pentoxifylline Pentoxyphylline
TypeSmall organic molecule
Emp. Form.C13H18N4O3
Mol. Mass.278.307
SMILESCC(=O)CCCCn1c(=O)n(C)c2ncn(C)c2c1=O