Reaction Details
TargetEndochitinase B1 [E322A]
LigandBDBM10853
Substrate/CompetitorBDBM10852
Meas. Tech.Enzyme Inhibition Assay
Kd 1370±n/a nM
Citation Rao, FVHouston, DRBoot, RGAerts, JMHodkinson, MAdams, DJShiomi, KOmura, Svan Aalten, DM Specificity and affinity of natural product cyclopentapeptide inhibitors against A. fumigatus, human, and bacterial chitinases. Chem Biol12:65-76 (2005) 
 
Endochitinase B1 [E322A]
Name:Endochitinase B1 [E322A]
Type:Enzyme
Mol. Mass.:47555.94
Organism:Aspergillus fumigatus
Description:Q873X9[E322A]
Residue:433
BDBM10853
BDBM10852
NameBDBM10853
Synonyms:(2R,5S,8S,11S,15S)-8-benzyl-2,7-dimethyl-5-[3-({[(methylcarbamoyl)amino]methanimidoyl}amino)propyl]-3,6,9,13,17-pentaoxo-1,4,7,10,14-pentaazacycloheptadecane-11,15-dicarboxylic acid | Argifin
TypeSmall organic molecule
Emp. Form.C29H41N9O10
Mol. Mass.675.6901
SMILESCNC(=O)NC(=N)NCCC[C@@H]1NC(=O)[C@@H](C)NC(=O)C[C@H](NC(=O)C[C@H](NC(=O)[C@H](Cc2ccccc2)N(C)C1=O)C(O)=O)C(O)=O