Reaction Details
TargetCarbonic anhydrase 1
LigandBDBM10865
Substrate/CompetitorBDBM10856
Meas. Tech.CA Inhibition Assay
pH7.5±n/a
Temperature298.15±n/a K
Ki 6000±n/a nM
Citation Nishimori, IMinakuchi, TMorimoto, KSano, SOnishi, STakeuchi, HVullo, DScozzafava, ASupuran, CT Carbonic anhydrase inhibitors: DNA cloning and inhibition studies of the alpha-carbonic anhydrase from Helicobacter pylori, a new target for developing sulfonamide and sulfamate gastric drugs. J Med Chem49:2117-26 (2006) 
 
Carbonic anhydrase 1
Name:Carbonic anhydrase 1
Type:Enzyme
Mol. Mass.:28873.37
Organism:Homo sapiens (Human)
Description:P00915
Residue:261
BDBM10865
BDBM10856
NameBDBM10865
Synonyms:4-Amino-3-iodobenzenesulfonamide CHEMBL268177 halogenosulfanilamide deriv. 5e
TypeSmall organic molecule
Emp. Form.C6H7IN2O2S
Mol. Mass.298.101
SMILESNc1ccc(cc1I)S(N)(=O)=O