Reaction Details
TargetCarbonic anhydrase 1
LigandBDBM10866
Substrate/CompetitorBDBM10856
Meas. Tech.CA Inhibition Assay
pH7.5±n/a
Temperature298.15±n/a K
Ki 5800±n/a nM
Citation Nishimori, IMinakuchi, TMorimoto, KSano, SOnishi, STakeuchi, HVullo, DScozzafava, ASupuran, CT Carbonic anhydrase inhibitors: DNA cloning and inhibition studies of the alpha-carbonic anhydrase from Helicobacter pylori, a new target for developing sulfonamide and sulfamate gastric drugs. J Med Chem49:2117-26 (2006) 
 
Carbonic anhydrase 1
Name:Carbonic anhydrase 1
Type:Enzyme
Mol. Mass.:28873.37
Organism:Homo sapiens (Human)
Description:P00915
Residue:261
BDBM10866
BDBM10856
NameBDBM10866
Synonyms:4-amino-6-(trifluoromethyl)benzene-1,3-disulfonamide aromatic/heteroaromatic sulfonamide 11
TypeSmall organic molecule
Emp. Form.C7H8F3N3O4S2
Mol. Mass.319.281
SMILESNc1cc(c(cc1S(N)(=O)=O)S(N)(=O)=O)C(F)(F)F