Reaction Details
TargetCarbonic anhydrase 1
LigandBDBM4703
Substrate/CompetitorBDBM10856
Meas. Tech.CA Inhibition Assay
Ki 23000±n/a nM
Citation Nishimori, IMinakuchi, TMorimoto, KSano, SOnishi, STakeuchi, HVullo, DScozzafava, ASupuran, CT Carbonic anhydrase inhibitors: DNA cloning and inhibition studies of the alpha-carbonic anhydrase from Helicobacter pylori, a new target for developing sulfonamide and sulfamate gastric drugs. J Med Chem49:2117-26 (2006) 
 
Carbonic anhydrase 1
Name:Carbonic anhydrase 1
Type:Enzyme
Mol. Mass.:28873.37
Organism:Homo sapiens (Human)
Description:P00915
Residue:261
BDBM4703
BDBM10856
NameBDBM4703
Synonyms:4-carboxybenzenesulfonamide 1 Benzoic Acid deriv. 31 JMC522226 Compound 22 JMC52646 Compound 23 | aromatic/heteroaromatic sulfonamide 23
TypeSmall organic molecule
Emp. Form.C7H7NO4S
Mol. Mass.201.2
SMILESNS(=O)(=O)c1ccc(cc1)C(O)=O