Reaction Details
TargetCarbonic anhydrase 2
LigandBDBM10893
Substrate/CompetitorBDBM10856
Meas. Tech.CA Inhibition Assay
Ki 133±n/a nM
Citation Nishimori, IMinakuchi, TMorimoto, KSano, SOnishi, STakeuchi, HVullo, DScozzafava, ASupuran, CT Carbonic anhydrase inhibitors: DNA cloning and inhibition studies of the alpha-carbonic anhydrase from Helicobacter pylori, a new target for developing sulfonamide and sulfamate gastric drugs. J Med Chem49:2117-26 (2006) 
 
Carbonic anhydrase 2
Name:Carbonic anhydrase 2
Type:Enzyme
Mol. Mass.:29250.71
Organism:Homo sapiens (Human)
Description:P00918
Residue:260
BDBM10893
BDBM10856
NameBDBM10893
Synonyms:4-(4-tert-Butylphenylcarboxamido)benzenesulfonamide aromatic/heteroaromatic sulfonamide 27
TypeSmall organic molecule
Emp. Form.C17H20N2O3S
Mol. Mass.332.417
SMILESCC(C)(C)c1ccc(cc1)C(=O)Nc1ccc(cc1)S(N)(=O)=O