Reaction Details
TargetCarbonic anhydrase 2
LigandBDBM10897
Substrate/CompetitorBDBM10856
Meas. Tech.CA Inhibition Assay
Ki 354±n/a nM
Citation Nishimori, IMinakuchi, TMorimoto, KSano, SOnishi, STakeuchi, HVullo, DScozzafava, ASupuran, CT Carbonic anhydrase inhibitors: DNA cloning and inhibition studies of the alpha-carbonic anhydrase from Helicobacter pylori, a new target for developing sulfonamide and sulfamate gastric drugs. J Med Chem49:2117-26 (2006) 
 
Carbonic anhydrase 2
Name:Carbonic anhydrase 2
Type:Enzyme
Mol. Mass.:29250.71
Organism:Homo sapiens (Human)
Description:P00918
Residue:260
BDBM10897
BDBM10856
NameBDBM10897
Synonyms:1-N-(4-tert-butylbenzene)benzene-1,2-disulfonamide aromatic/heteroaromatic sulfonamide 31
TypeSmall organic molecule
Emp. Form.C16H20N2O4S2
Mol. Mass.368.471
SMILESCC(C)(C)c1ccc(cc1)S(=O)(=O)Nc1ccccc1S(N)(=O)=O