Reaction Details
TargetCarbonic anhydrase 2
LigandBDBM10901
Substrate/CompetitorBDBM10856
Meas. Tech.CA Inhibition Assay
Ki 94±n/a nM
Citation Nishimori, IMinakuchi, TMorimoto, KSano, SOnishi, STakeuchi, HVullo, DScozzafava, ASupuran, CT Carbonic anhydrase inhibitors: DNA cloning and inhibition studies of the alpha-carbonic anhydrase from Helicobacter pylori, a new target for developing sulfonamide and sulfamate gastric drugs. J Med Chem49:2117-26 (2006) 
 
Carbonic anhydrase 2
Name:Carbonic anhydrase 2
Type:Enzyme
Mol. Mass.:29250.71
Organism:Homo sapiens (Human)
Description:P00918
Residue:260
BDBM10901
BDBM10856
NameBDBM10901
Synonyms:4-(4-tert-Butylphenylsulfonamidoethyl)benzenesulfonamide aromatic/heteroaromatic sulfonamide 35
TypeSmall organic molecule
Emp. Form.C18H24N2O4S2
Mol. Mass.396.524
SMILESCC(C)(C)c1ccc(cc1)S(=O)(=O)NCCc1ccc(cc1)S(N)(=O)=O