Reaction Details
TargetCARBONIC ANHYDRASE
LigandBDBM10872
Substrate/CompetitorBDBM10856
Meas. Tech.CA Inhibition Assay
Ki 114±n/a nM
Citation Nishimori, IMinakuchi, TMorimoto, KSano, SOnishi, STakeuchi, HVullo, DScozzafava, ASupuran, CT Carbonic anhydrase inhibitors: DNA cloning and inhibition studies of the alpha-carbonic anhydrase from Helicobacter pylori, a new target for developing sulfonamide and sulfamate gastric drugs. J Med Chem49:2117-26 (2006) 
 
CARBONIC ANHYDRASE
Name:CARBONIC ANHYDRASE
Type:Enzyme
Mol. Mass.:28277.52
Organism:Helicobacter pylori J99
Description:Q9ZK30
Residue:247
BDBM10872
BDBM10856
NameBDBM10872
Synonyms:4-amino-N-[2-(4-sulfamoylphenyl)ethyl]benzene-1-sulfonamide aromatic/heteroaromatic sulfonamide 17
TypeSmall organic molecule
Emp. Form.C14H17N3O4S2
Mol. Mass.355.432
SMILESNc1ccc(cc1)S(=O)(=O)NCCc1ccc(cc1)S(N)(=O)=O