Reaction Details
TargetCARBONIC ANHYDRASE
LigandBDBM10874
Substrate/CompetitorBDBM10856
Meas. Tech.CA Inhibition Assay
Ki 207±n/a nM
Citation Nishimori, IMinakuchi, TMorimoto, KSano, SOnishi, STakeuchi, HVullo, DScozzafava, ASupuran, CT Carbonic anhydrase inhibitors: DNA cloning and inhibition studies of the alpha-carbonic anhydrase from Helicobacter pylori, a new target for developing sulfonamide and sulfamate gastric drugs. J Med Chem49:2117-26 (2006) 
 
CARBONIC ANHYDRASE
Name:CARBONIC ANHYDRASE
Type:Enzyme
Mol. Mass.:28277.52
Organism:Helicobacter pylori J99
Description:Q9ZK30
Residue:247
BDBM10874
BDBM10856
NameBDBM10874
Synonyms:6-hydroxy-1,3-benzothiazole-2-sulfonamide aromatic/heteroaromatic sulfonamide 19
TypeSmall organic molecule
Emp. Form.C7H6N2O3S2
Mol. Mass.230.264
SMILESNS(=O)(=O)c1nc2ccc(O)cc2s1