Reaction Details
TargetCARBONIC ANHYDRASE
LigandBDBM10877
Substrate/CompetitorBDBM10856
Meas. Tech.CA Inhibition Assay
Ki 1134±n/a nM
Citation Nishimori, IMinakuchi, TMorimoto, KSano, SOnishi, STakeuchi, HVullo, DScozzafava, ASupuran, CT Carbonic anhydrase inhibitors: DNA cloning and inhibition studies of the alpha-carbonic anhydrase from Helicobacter pylori, a new target for developing sulfonamide and sulfamate gastric drugs. J Med Chem49:2117-26 (2006) 
 
CARBONIC ANHYDRASE
Name:CARBONIC ANHYDRASE
Type:Enzyme
Mol. Mass.:28277.52
Organism:Helicobacter pylori J99
Description:Q9ZK30
Residue:247
BDBM10877
BDBM10856
NameBDBM10877
Synonyms:4-(2-hydroxyethyl)benzene-1-sulfonamide JMC522226 Compound 21 aromatic/heteroaromatic sulfonamide 22
TypeSmall organic molecule
Emp. Form.C8H11NO3S
Mol. Mass.201.243
SMILESNS(=O)(=O)c1ccc(CCO)cc1