Reaction Details
TargetHigh affinity cGMP-specific 3',5'-cyclic phosphodiesterase 9A
LigandBDBM317140
Substrate/Competitorn/a
Meas. Tech.Inhibition Assay
IC50 0.600±n/a nM
Citation Luo, HWan, YKe, HLiu, PHuang, MShao, YZhu, XCai, YLiu, Y N-substituted pyrazolo [3,4-D] pyrimidine ketone compound, and preparation process and use thereof US Patent US9617269 Publication Date 4/11/2017
 
High affinity cGMP-specific 3',5'-cyclic phosphodiesterase 9A
Name:High affinity cGMP-specific 3',5'-cyclic phosphodiesterase 9A
Type:Protein
Mol. Mass.:68488.40
Organism:Homo sapiens (Human)
Description:O76083
Residue:593
BDBM317140
NameBDBM317140
Synonyms:US9617269, Compound WYQ-90-D
TypeSmall organic molecule
Emp. Form.C20H26N6O3
Mol. Mass.398.4588
SMILESCOc1ccc(NC(=O)C(C)NC2=NC3C(C=NN3C3CCCC3)C(=O)N2)cc1