Reaction Details
TargetHigh affinity cGMP-specific 3',5'-cyclic phosphodiesterase 9A
LigandBDBM50034639
Substrate/Competitorn/a
Meas. Tech.Inhibition Assay
IC50 6.00±n/a nM
Citation Luo, HWan, YKe, HLiu, PHuang, MShao, YZhu, XCai, YLiu, Y N-substituted pyrazolo [3,4-D] pyrimidine ketone compound, and preparation process and use thereof US Patent US9617269 Publication Date 4/11/2017
 
High affinity cGMP-specific 3',5'-cyclic phosphodiesterase 9A
Name:High affinity cGMP-specific 3',5'-cyclic phosphodiesterase 9A
Type:Protein
Mol. Mass.:68488.40
Organism:Homo sapiens (Human)
Description:O76083
Residue:593
BDBM50034639
NameBDBM50034639
Synonyms:CHEMBL3360414 | US9617269, Compound WYQ-91
TypeSmall organic molecule
Emp. Form.C19H22N6O3
Mol. Mass.382.4164
SMILESCOc1ccc(NC(=O)CNc2nc3n(ncc3c(=O)[nH]2)C2CCCC2)cc1